{"text_format":"1","workbook":"xlsx","n_sheets":8,"sheets":["DE Sig matrix","Instructions","Approval Form","Content Review Report","Form 1","Form 2","Form 3","Changes"],"not_rendered":{"charts":0,"images":1,"macros":0,"external_links":0,"defined_names":6,"comments":1,"pivot_tables":0},"unopened":[],"bounds":{"document_bytes":16777216,"sheet_cells":100000,"rows_first":2000,"rows_last":500,"rows_between":2000,"halvings":0,"cell_chars":16384,"cell_head_chars":4096},"cells_cut":0,"cells_raw":0,"read":"whole","date_system":"1900"}

{"sheet":"DE Sig matrix","index":0,"n_rows":31,"n_cols":2,"rows_kept":31,"cut":false,"hidden":true,"merged":[]}
["Clause","Description"]
["A","The FAI is not complete (non-conformance identified)."]
["B","Dimensional characteristics are not accessible for verification at the end of the production process."]
["C","Dimensional characteristics, accessible at the end of the production process, have not been verified."]
["D","Dimensional characteristics have been verified using measuring equipment which is not capable."]
["E","Requirements of this FAIR have been satisfied through the read across from a previously approved FAIR."]
{"$rows_left_out":26}
{"sheet":"Instructions","index":1,"n_rows":52,"n_cols":37,"rows_kept":52,"cut":false,"hidden":false,"merged":[[50,35,50,42],[48,35,48,42],[49,35,49,42],[29,25,29,32],[32,25,32,32],[37,25,37,32],[41,25,41,32],[38,25,38,32],[43,25,43,32],[44,25,44,32],[46,35,47,42],[36,35,36,42],[30,35,30,42],[31,35,31,42],[35,35,35,42],[45,35,45,42],[51,3,55,12],[30,4,32,12],[42,25,42,32],[34,15,34,22],[35,15,35,22],[36,15,37,22],[39,15,40,22],[39,25,40,32],[42,3,43,12],[47,3,48,12],[42,15,42,22],[43,15,43,22],[7,34,8,42],[9,34,11,42],[17,35,18,42],[7,1,8,12],[29,15,29,22],[11,15,12,22],[20,15,22,22],[19,15,19,22],[13,15,14,22],[23,15,23,22],[24,15,24,22],[26,35,27,42],[16,35,16,42],[21,35,23,42],[28,35,29,42],[43,35,44,42],[39,36,39,42],[32,35,33,42],[34,35,34,42],[40,35,42,42],[1,34,1,41],[31,26,31,32],[33,26,33,32],[1,24,1,31],[3,34,6,42],[14,35,15,42],[3,24,5,32],[7,25,8,32],[9,25,10,32],[15,25,15,32],[20,25,20,32],[11,25,12,32],[13,25,14,32],[16,26,16,32],[19,35,20,42],[24,35,25,42],[3,1,5,12],[39,3,41,12],[21,26,21,32],[22,26,22,32],[23,25,24,32],[34,26,34,32],[35,25,36,32],[19,25,19,32],[25,25,28,32],[17,25,17,32],[18,26,18,32],[31,15,32,22],[41,15,41,22],[1,1,1,12],[3,14,5,22],[37,35,38,42],[1,14,1,21],[20,3,21,12],[27,15,27,22],[28,15,28,22],[30,15,30,22],[33,15,33,22],[7,15,8,22],[9,15,10,22],[15,15,16,22],[17,15,18,22],[25,15,26,22],[30,26,30,32],[38,15,38,22]]}
[]
[null,"FAIR approval, forms and checklist - Instructions ",null,null,null,null,null,null,null,null,null,null,null,null,"Fields in Form 1 Explained ",null,null,null,null,null,null,null,null,null,"Fields in Form 2 Explained ",null,null,null,null,null,null,null,null,null,"Fields in Form 3 Explained "]
[]
[null,"PLEASE NOTE: The intention is for the forms to be completed electronically and then printed after completion for signatures. If the user intends to print a paper copy of the forms to complete please ensure you complete steps 1 and 2 below before printing. This will avoid the user having to input the same headings in each of the forms manually.",null,null,null,null,null,null,null,null,null,null,null,null,"Form 1 is used to identify the part number that is identified as being the FAIR product and any applicable sub-assemblies or detail parts. This form is only relevant if the FAIR is for an assembly product; if it is a detail part then please skip form 1 and continue to form 2.",null,null,null,null,null,null,null,null,null,"Form 2 is used to identify the raw materials, specifications, special processes and functional testing required for the maufacture of the FAIR part or product and to demonstrate conformance to the design requirements of the product",null,null,null,null,null,null,null,null,null,"Form 3 is used to identify and record the physical dimensions of the FAIR and to identify any special tooling that is used for such operations.The form data will demonsrate conformance to the Design requirements of the product and in cases of non-conformance identify the Engineering acceptance by use of a concession"]
[]
[]
{"$rows_left_out":47}
{"sheet":"Approval Form","index":2,"n_rows":36,"n_cols":47,"rows_kept":36,"cut":false,"hidden":false,"merged":[[33,23,33,33],[34,23,34,33],[32,34,32,38],[25,8,25,22],[26,8,26,22],[25,23,25,33],[26,23,26,33],[31,23,31,33],[31,34,31,38],[32,8,32,22],[32,23,32,33],[33,8,33,22],[26,34,26,38],[22,2,22,38],[33,34,33,38],[36,2,36,38],[27,1,27,38],[28,2,28,37],[29,2,30,7],[31,2,32,7],[33,2,34,7],[29,8,30,38],[31,8,31,22],[34,34,34,38],[25,2,26,7],[25,34,25,38],[35,2,35,38],[23,2,24,38],[34,8,34,22],[1,2,1,29],[21,1,21,38],[2,2,2,38],[12,24,12,38],[13,24,13,38],[14,24,14,38],[11,24,11,38],[3,26,4,30],[3,31,4,38],[3,2,4,7],[3,18,4,25],[3,13,4,17],[3,8,4,12],[5,2,8,7],[17,2,17,18],[15,2,15,18],[20,19,20,38],[19,2,19,18],[20,2,20,18],[12,19,12,23],[13,19,13,23],[14,2,14,7],[15,19,15,38],[16,19,16,38],[17,19,17,38],[18,19,18,38],[14,8,14,18],[14,19,14,23],[16,2,16,18],[12,8,12,18],[13,8,13,18],[13,2,13,7],[10,2,10,38],[11,19,11,23],[5,26,8,38],[19,19,19,38],[5,8,8,21],[5,22,8,25],[9,1,9,38],[11,8,11,18],[12,2,12,7],[11,2,11,7],[18,2,18,18]]}
[null,null,"FAIR Report Approval Form - Front Sheet",null,null,null,null,null,null,null,null,null,null,null,null,null,null,null,null,null,null,null,null,null,null,null,null,null,null,null,null,null,null,null,null,null,null,null,null,null,null,null,null,null,"FAIR","LAIR"]
[null,null,{"$f":"IF(AND(AS2,AT2)=TRUE,\"You cannot select both FAIR and LAIR. Please check only one box\",IF(AND(AS4,AT4=TRUE),\"You cannot select both Full and Partial. Please check only one box\",IF(AND(AS6,AT6)=TRUE,\"You cannot select both Assembly and Detail. Please check only one box\",IF(COUNTIF(AT7:AT12,TRUE)>1,\"Multiple reasons for FAIR/LAIR have been selected. Please select only the main reason\",IF(COUNTIF(AT13:AT15,TRUE)>1,\"Multiple authorisation decisions have been selected. Please check only one box\",IF(AT13=TRUE,\"FAIR/LAIR has been approved\",IF(AT14=TRUE,\"FAIR/LAIR has been approved with concession\",IF(AT15=TRUE,\"FAIR/LAIR has been rejected\",\" \"))))))))","v":" "},null,null,null,null,null,null,null,null,null,null,null,null,null,null,null,null,null,null,null,null,null,null,null,null,null,null,null,null,null,null,null,null,null,null,null,null,null,null,null,null,null,false,false]
[null,null,"FAIR Information : Complete all fields",null,null,null,null,null,null,null,null,null,null,null,null,null,null,null,null,null,null,null,null,null,null,null,null,null,null,null,null,null,null,null,null,null,null,null,null,null,null,null,null,null,"Full","Partial"]
[null,null,"Report Type:",null,null,null,null,null,null,null,null,null,null,null,null,null,null,null,null,null,null,null,null,null,null,null,"FAIR Report Number:",null,null,null,null,{"$f":"IF(Y15=\"\",\"Vendor Code Required\",IF(I12=\"\",\"Part/Item Number Required\",IF(AS4=AT4,\"Select 'Full' or 'Partial' FAIR\",CONCATENATE(Y15,\" - \",I12,\" - \",(IF(AS4=TRUE,\"F\",IF(AT4=TRUE,\"P\",\" \")))))))","v":"Vendor Code Required"},null,null,null,null,null,null,null,null,null,null,null,null,false,false]
[null,null,null,null,null,null,null,null,null,null,null,null,null,null,null,null,null,null,null,null,null,null,null,null,null,null,null,null,null,null,null,null,null,null,null,null,null,null,null,null,null,null,null,null,"Assembly","Detail"]
[null,null,"Reason for FAIR: ",null,null,null,null,null,null,null,null,null,null,null,null,null,null,null,null,null,null,null,"Comments:",null,null,null,null,null,null,null,null,null,null,null,null,null,null,null,null,null,null,null,null,null,false,false]
{"$rows_left_out":31}
{"sheet":"Content Review Report","index":3,"n_rows":54,"n_cols":44,"rows_kept":54,"cut":false,"hidden":false,"merged":[[0,29,0,33],[0,34,0,39],[52,3,52,20],[52,25,52,39],[47,3,47,20],[47,25,47,39],[48,3,48,20],[48,25,48,39],[52,21,52,22],[52,23,52,24],[41,3,41,20],[41,25,41,39],[42,3,42,20],[42,25,42,39],[43,3,43,20],[43,25,43,39],[41,21,41,22],[41,23,41,24],[42,21,42,22],[42,23,42,24],[43,21,43,22],[43,23,43,24],[39,25,39,39],[40,3,40,20],[53,3,53,20],[53,25,53,39],[53,21,53,22],[53,23,53,24],[44,3,44,20],[44,25,44,39],[45,3,45,20],[45,25,45,39],[46,3,46,20],[46,25,46,39],[44,21,44,22],[44,23,44,24],[45,21,45,22],[45,23,45,24],[46,21,46,22],[46,23,46,24],[47,21,47,22],[47,23,47,24],[48,21,48,22],[48,23,48,24],[50,21,50,22],[50,23,50,24],[51,21,51,22],[51,23,51,24],[40,25,40,39],[35,3,35,20],[35,25,35,39],[36,3,36,20],[36,25,36,39],[37,3,37,20],[37,25,37,39],[35,21,35,22],[35,23,35,24],[36,21,36,22],[36,23,36,24],[37,21,37,22],[37,23,37,24],[38,21,38,22],[38,23,38,24],[39,21,39,22],[39,23,39,24],[40,21,40,22],[40,23,40,24],[38,3,38,20],[38,25,38,39],[39,3,39,20],[33,3,33,20],[33,25,33,39],[34,3,34,20],[34,25,34,39],[10,3,10,20],[10,25,10,39],[11,3,11,39],[12,3,12,20],[12,25,12,39],[13,25,13,39],[15,25,15,39],[16,25,16,39],[17,25,17,39],[18,25,18,39],[19,25,19,39],[20,25,20,39],[21,25,21,39],[22,25,22,39],[23,25,23,39],[24,25,24,39],[25,25,25,39],[26,25,26,39],[13,3,13,20],[32,25,32,39],[14,25,14,39],[2,2,2,20],[2,21,2,22],[2,25,2,39],[1,2,1,5],[1,6,1,10],[1,11,1,14],[1,15,1,28],[1,29,1,32],[1,33,1,39],[7,3,7,39],[8,3,8,20],[8,25,8,39],[9,3,9,20],[9,25,9,39],[3,3,3,39],[4,3,4,20],[4,25,4,39],[5,3,5,20],[5,25,5,39],[6,3,6,20],[6,25,6,39],[14,3,14,20],[15,3,15,20],[16,3,16,20],[17,3,17,20],[22,3,22,20],[32,3,32,20],[18,3,18,20],[19,3,19,20],[20,3,20,20],[21,3,21,20],[23,3,23,20],[24,3,24,20],[25,3,25,20],[26,3,26,20],[27,3,27,20],[28,3,28,20],[29,3,29,20],[30,3,30,20],[31,3,31,20],[27,25,27,39],[28,25,28,39],[29,25,29,39],[30,25,30,39],[31,25,31,39],[2,23,2,24],[4,21,4,22],[4,23,4,24],[5,21,5,22],[5,23,5,24],[6,21,6,22],[6,23,6,24],[8,21,8,22],[8,23,8,24],[9,21,9,22],[9,23,9,24],[10,21,10,22],[10,23,10,24],[12,21,12,22],[12,23,12,24],[13,21,13,22],[13,23,13,24],[14,21,14,22],[14,23,14,24],[15,21,15,22],[15,23,15,24],[16,21,16,22],[16,23,16,24],[17,21,17,22],[17,23,17,24],[18,21,18,22],[18,23,18,24],[19,21,19,22],[19,23,19,24],[28,23,28,24],[29,21,29,22],[29,23,29,24],[20,21,20,22],[20,23,20,24],[21,21,21,22],[21,23,21,24],[22,21,22,22],[22,23,22,24],[23,21,23,22],[23,23,23,24],[24,21,24,22],[24,23,24,24],[49,3,49,39],[50,3,50,20],[50,25,50,39],[51,3,51,20],[51,25,51,39],[0,2,0,14],[0,15,0,28],[30,21,30,22],[30,23,30,24],[31,21,31,22],[31,23,31,24],[32,21,32,22],[32,23,32,24],[33,21,33,22],[33,23,33,24],[34,21,34,22],[34,23,34,24],[25,21,25,22],[25,23,25,24],[26,21,26,22],[26,23,26,24],[27,21,27,22],[27,23,27,24],[28,21,28,22]]}
[null,null,"FAIR CONTENTS CHECKLIST",null,null,null,null,null,null,null,null,null,null,null,null,{"$f":"IF(COUNTIF(AQ1:AQ39,-1)>0,\"STATUS: INCOMPLETE\",IF(COUNTIF(AQ1:AQ39,0.5)>0,\"STATUS: INCOMPLETE\",\"STATUS: COMPLETE\"))","v":"STATUS: INCOMPLETE"},null,null,null,null,null,null,null,null,null,null,null,null,null,"Report Reference:",null,null,null,null,{"$f":"'Approval Form'!AF4","v":"Vendor Code Required"},null,null,null,null,null,null,"YES",{"$f":"X5","v":0.5},"Source change?"]
[null,null,"Part/Item Number:",null,null,null,{"$f":"'Approval Form'!I12","v":0},null,null,null,null,"Part/Item Name:",null,null,null,{"$f":"'Approval Form'!I13","v":0},null,null,null,null,null,null,null,null,null,null,null,null,null,"Report Type:",null,null,null,{"$f":"'Approval Form'!AS17","v":"Approval Form Incomplete"},null,null,null,null,null,null,null,"NO",{"$f":"X6","v":0.5},{"$f":"'Approval Form'!AT9","v":false}]
[null,null,"Content Review Question",null,null,null,null,null,null,null,null,null,null,null,null,null,null,null,null,null,null,"Reply",null,"Status",null,"Comment",null,null,null,null,null,null,null,null,null,null,null,null,null,null,null,"N/A",{"$f":"X7","v":" "},"reason selected"]
[null,null,1,"First Article Inspection Report - Approval Form ",null,null,null,null,null,null,null,null,null,null,null,null,null,null,null,null,null,null,null,null,null,null,null,null,null,null,null,null,null,null,null,null,null,null,null,null,null,null,{"$f":"X9","v":0.5},{"$f":"COUNTIF('Approval Form'!AT7:AT12,FALSE)","v":5}]
[null,null,1.1000000000000001,"Is the FAIR front sheet included with all the boxes as required by the supplier complete?",null,null,null,null,null,null,null,null,null,null,null,null,null,null,null,null,null,null,null,{"$f":"IF(V5=\"YES\",1,IF(V5=\"NO\",-1,IF(V5=0,0.5,\" \")))","v":0.5},null,null,null,null,null,null,null,null,null,null,null,null,null,null,null,null,null,null,{"$f":"X10","v":0.5}]
[null,null,1.2,"Is a copy of the purchase order included?",null,null,null,null,null,null,null,null,null,null,null,null,null,null,null,null,null,null,null,{"$f":"IF(V6=\"YES\",1,IF(V6=\"NO\",-1,IF(V6=0,0.5,\" \")))","v":0.5},null,null,null,null,null,null,null,null,null,null,null,null,null,null,null,null,null,null,{"$f":"X11","v":0.5}]
{"$rows_left_out":49}
{"sheet":"Form 1","index":4,"n_rows":47,"n_cols":34,"rows_kept":47,"cut":false,"hidden":false,"merged":[[1,1,1,34],[0,1,0,28],[9,9,9,15],[10,9,10,15],[9,16,9,18],[10,16,10,18],[38,1,38,34],[36,1,36,8],[36,9,36,18],[12,1,12,34],[36,19,36,27],[36,28,36,34],[37,1,37,8],[37,9,37,18],[37,19,37,27],[37,28,37,34],[34,1,34,8],[34,9,34,18],[34,19,34,27],[34,28,34,34],[35,1,35,8],[35,9,35,18],[35,19,35,27],[35,28,35,34],[32,1,32,8],[32,9,32,18],[32,19,32,27],[32,28,32,34],[33,1,33,8],[33,9,33,18],[33,19,33,27],[33,28,33,34],[30,1,30,8],[30,9,30,18],[30,19,30,27],[30,28,30,34],[31,1,31,8],[31,9,31,18],[31,19,31,27],[31,28,31,34],[28,1,28,8],[28,9,28,18],[28,19,28,27],[28,28,28,34],[29,1,29,8],[29,9,29,18],[29,19,29,27],[29,28,29,34],[26,1,26,8],[26,9,26,18],[26,19,26,27],[26,28,26,34],[27,1,27,8],[27,9,27,18],[27,19,27,27],[27,28,27,34],[24,1,24,8],[24,9,24,18],[24,19,24,27],[24,28,24,34],[25,1,25,8],[25,9,25,18],[25,19,25,27],[25,28,25,34],[22,1,22,8],[22,9,22,18],[22,19,22,27],[22,28,22,34],[23,1,23,8],[23,9,23,18],[23,19,23,27],[23,28,23,34],[20,1,20,8],[20,9,20,18],[20,19,20,27],[20,28,20,34],[21,1,21,8],[21,9,21,18],[21,19,21,27],[21,28,21,34],[18,1,18,8],[18,9,18,18],[18,19,18,27],[18,28,18,34],[19,1,19,8],[19,9,19,18],[19,19,19,27],[19,28,19,34],[16,1,16,8],[16,28,16,34],[17,9,17,18],[17,1,17,8],[17,19,17,27],[17,28,17,34],[10,19,10,34],[7,19,7,26],[8,19,8,26],[16,9,16,18],[16,19,16,27],[14,1,14,34],[15,1,15,34],[13,1,13,34],[9,19,9,34],[7,27,7,34],[9,1,9,6],[10,1,10,6],[11,1,11,34],[8,27,8,34],[7,1,7,18],[8,1,8,18],[6,27,6,34],[3,9,3,18],[3,27,3,34],[4,9,4,18],[4,27,4,34],[3,1,3,8],[4,1,4,8],[3,19,3,26],[5,19,5,26],[4,19,4,26],[6,19,6,26],[5,1,5,8],[5,9,5,18],[5,27,5,34],[6,1,6,8],[6,9,6,18],[47,28,47,34],[42,1,42,34],[39,1,39,34],[40,1,40,15],[40,16,40,27],[40,28,40,34],[43,1,43,15],[43,16,43,27],[43,28,43,34],[41,1,41,15],[41,16,41,27],[41,28,41,34],[46,1,46,15],[46,16,46,27],[46,28,46,34],[45,1,45,34],[44,1,44,15],[44,16,44,27],[44,28,44,34],[47,1,47,15],[47,16,47,27]]}
[null,"First Article Inspection",null,null,null,null,null,null,null,null,null,null,null,null,null,null,null,null,null,null,null,null,null,null,null,null,null,null,null,"Page",null,1,"of",1]
[null,"Form 1: Part/Item Information"]
[]
[null,"1. Part Number: ",null,null,null,null,null,null,null,"2. Part Name:",null,null,null,null,null,null,null,null,null,"3. Serial Number:",null,null,null,null,null,null,null,"4. FAI Report Number:"]
[null,{"$f":"'Approval Form'!I12","v":0},null,null,null,null,null,null,null,{"$f":"'Approval Form'!I13","v":0},null,null,null,null,null,null,null,null,null,{"$f":"'Approval Form'!Y13","v":0},null,null,null,null,null,null,null,{"$f":"'Approval Form'!AF4","v":"Vendor Code Required"}]
[null,"5. Part/Item Drawing Revision:",null,null,null,null,null,null,null,"6. Manufacturers Drawing Number: (if applicable)",null,null,null,null,null,null,null,null,null,"7. Drawing Revision Level: (if applicable)",null,null,null,null,null,null,null,"8. Manufacturing Process Identification: (if applicable)"]
{"$rows_left_out":42}
{"sheet":"Form 2","index":5,"n_rows":42,"n_cols":36,"rows_kept":42,"cut":false,"hidden":false,"merged":[[11,1,11,8],[10,1,10,8],[21,1,21,8],[10,27,10,35],[40,1,40,35],[41,1,41,15],[41,16,41,27],[41,28,41,35],[42,1,42,15],[42,16,42,27],[42,28,42,35],[26,9,26,17],[22,18,22,26],[23,18,23,26],[24,18,24,26],[25,18,25,26],[39,28,39,35],[38,1,38,15],[39,1,39,15],[39,16,39,27],[34,1,34,17],[34,18,34,35],[37,1,37,35],[36,1,36,35],[26,18,26,26],[20,1,20,8],[7,9,7,17],[8,9,8,17],[35,1,35,35],[9,9,9,17],[6,18,6,26],[7,18,7,26],[8,18,8,26],[9,18,9,26],[22,9,22,17],[23,9,23,17],[18,9,18,17],[19,9,19,17],[20,9,20,17],[21,9,21,17],[26,1,26,8],[26,27,26,35],[24,27,24,35],[25,1,25,8],[25,27,25,35],[24,1,24,8],[24,9,24,17],[25,9,25,17],[21,18,21,26],[20,18,20,26],[11,27,11,35],[22,1,22,8],[22,27,22,35],[23,1,23,8],[23,27,23,35],[5,27,5,35],[17,27,17,35],[17,9,17,17],[17,18,17,26],[18,18,18,26],[12,9,12,17],[13,9,13,17],[12,1,12,8],[12,27,12,35],[13,1,13,8],[13,27,13,35],[14,9,14,17],[15,9,15,17],[16,9,16,17],[10,9,10,17],[11,9,11,17],[19,1,19,8],[19,27,19,35],[14,27,14,35],[15,1,15,8],[15,27,15,35],[18,1,18,8],[18,27,18,35],[16,1,16,8],[16,27,16,35],[17,1,17,8],[19,18,19,26],[21,27,21,35],[4,1,4,8],[0,1,0,27],[3,1,3,8],[8,1,8,8],[8,27,8,35],[9,1,9,8],[9,27,9,35],[6,27,6,35],[7,1,7,8],[7,27,7,35],[6,1,6,8],[4,18,4,26],[3,18,3,26],[5,9,5,17],[5,18,5,26],[3,27,3,35],[4,27,4,35],[5,1,5,8],[4,9,4,17],[3,9,3,17],[6,9,6,17],[20,27,20,35],[14,1,14,8],[1,1,1,27],[10,18,10,26],[11,18,11,26],[12,18,12,26],[13,18,13,26],[14,18,14,26],[15,18,15,26],[16,18,16,26],[38,28,38,35],[38,16,38,27],[27,18,27,35],[27,1,27,17],[28,1,28,17],[28,18,28,35],[29,1,29,17],[29,18,29,35],[30,1,30,17],[30,18,30,35],[31,1,31,17],[31,18,31,35],[32,1,32,17],[32,18,32,35],[33,1,33,17],[33,18,33,35]]}
[null,"First Article Inspection",null,null,null,null,null,null,null,null,null,null,null,null,null,null,null,null,null,null,null,null,null,null,null,null,null,null,null,null,null,"Page",null,1,"of",1]
[null,"Form 2: Product Manufacturing Records - Raw Materials, Condition of Supply, Specifications, Special Processes, and Functional Testing"]
[]
[null,"25. Part/Item Number:",null,null,null,null,null,null,null,"26. Part Name:",null,null,null,null,null,null,null,null,"27. Serial Number:",null,null,null,null,null,null,null,null,"28. FAIR Report Number:"]
[null,{"$f":"'Approval Form'!I12","v":0},null,null,null,null,null,null,null,{"$f":"'Approval Form'!I13","v":0},null,null,null,null,null,null,null,null,{"$f":"'Approval Form'!Y13","v":0},null,null,null,null,null,null,null,null,{"$f":"'Approval Form'!AF4","v":"Vendor Code Required"}]
[null,"29. Material or Process Name",null,null,null,null,null,null,null,"30. Specification",null,null,null,null,null,null,null,null,"31. Supplier of Material or Process",null,null,null,null,null,null,null,null,"32. Certificate of Conformity Number/Process Report Number "]
{"$rows_left_out":37}
{"sheet":"Form 3","index":6,"n_rows":53,"n_cols":54,"rows_kept":53,"cut":false,"hidden":false,"merged":[[31,19,31,22],[31,23,31,26],[31,27,31,33],[31,41,31,47],[31,48,31,53],[29,19,29,22],[29,23,29,26],[29,27,29,33],[29,41,29,47],[29,48,29,53],[30,19,30,22],[30,23,30,26],[30,27,30,33],[30,41,30,47],[30,48,30,53],[30,34,30,40],[31,34,31,40],[39,1,39,2],[39,3,39,6],[39,7,39,11],[39,12,39,18],[39,19,39,22],[39,23,39,26],[39,27,39,33],[39,41,39,47],[39,48,39,53],[39,34,39,40],[40,1,40,2],[40,3,40,6],[40,7,40,11],[40,12,40,18],[40,19,40,22],[40,23,40,26],[40,27,40,33],[40,41,40,47],[40,48,40,53],[40,34,40,40],[38,1,38,2],[38,3,38,6],[38,7,38,11],[38,12,38,18],[38,19,38,22],[38,23,38,26],[38,27,38,33],[38,41,38,47],[38,48,38,53],[38,34,38,40],[37,1,37,2],[37,3,37,6],[37,7,37,11],[37,12,37,18],[37,19,37,22],[37,23,37,26],[37,27,37,33],[37,41,37,47],[37,48,37,53],[37,34,37,40],[36,1,36,2],[36,3,36,6],[36,7,36,11],[36,12,36,18],[36,19,36,22],[36,23,36,26],[36,27,36,33],[36,41,36,47],[36,48,36,53],[36,34,36,40],[35,1,35,2],[35,3,35,6],[35,7,35,11],[35,12,35,18],[35,19,35,22],[35,23,35,26],[35,27,35,33],[35,41,35,47],[35,48,35,53],[35,34,35,40],[34,1,34,2],[34,3,34,6],[34,7,34,11],[34,12,34,18],[34,19,34,22],[34,23,34,26],[34,27,34,33],[34,41,34,47],[34,48,34,53],[34,34,34,40],[33,1,33,2],[33,3,33,6],[33,7,33,11],[33,12,33,18],[33,19,33,22],[33,23,33,26],[33,27,33,33],[33,41,33,47],[33,48,33,53],[33,34,33,40],[32,1,32,2],[32,3,32,6],[32,7,32,11],[32,12,32,18],[32,19,32,22],[32,23,32,26],[32,27,32,33],[32,41,32,47],[32,48,32,53],[32,34,32,40],[25,1,25,2],[25,3,25,6],[25,7,25,11],[25,12,25,18],[25,19,25,22],[25,23,25,26],[25,27,25,33],[25,41,25,47],[25,48,25,53],[25,34,25,40],[24,1,24,2],[24,3,24,6],[24,7,24,11],[24,12,24,18],[24,19,24,22],[24,23,24,26],[24,27,24,33],[24,41,24,47],[24,48,24,53],[24,34,24,40],[23,1,23,2],[23,3,23,6],[23,7,23,11],[23,12,23,18],[23,19,23,22],[23,23,23,26],[23,27,23,33],[23,41,23,47],[23,48,23,53],[23,34,23,40],[22,1,22,2],[22,3,22,6],[22,7,22,11],[22,12,22,18],[22,19,22,22],[22,23,22,26],[22,27,22,33],[22,41,22,47],[22,48,22,53],[22,34,22,40],[21,1,21,2],[21,3,21,6],[21,7,21,11],[21,12,21,18],[21,19,21,22],[21,23,21,26],[21,27,21,33],[21,41,21,47],[21,48,21,53],[21,34,21,40],[20,1,20,2],[20,3,20,6],[20,7,20,11],[20,12,20,18],[20,19,20,22],[20,23,20,26],[20,27,20,33],[20,41,20,47],[20,48,20,53],[20,34,20,40],[19,1,19,2],[19,3,19,6],[19,7,19,11],[19,12,19,18],[19,19,19,22],[19,23,19,26],[19,27,19,33],[19,41,19,47],[19,48,19,53],[19,34,19,40],[18,1,18,2],[18,3,18,6],[18,7,18,11],[18,12,18,18],[18,19,18,22],[18,23,18,26],[18,27,18,33],[18,41,18,47],[18,48,18,53],[18,34,18,40],[16,7,16,11],[16,12,16,18],[16,19,16,22],[16,23,16,26],[16,27,16,33],[16,41,16,47],[16,48,16,53],[16,34,16,40],[17,1,17,2],[17,3,17,6],[17,7,17,11],[17,12,17,18],[17,19,17,22],[17,23,17,26],[17,27,17,33],[17,41,17,47],[17,48,17,53],[17,34,17,40],[14,19,14,22],[14,23,14,26],[14,27,14,33],[14,41,14,47],[14,48,14,53],[14,34,14,40],[15,1,15,2],[15,3,15,6],[15,7,15,11],[15,12,15,18],[15,19,15,22],[15,23,15,26],[15,27,15,33],[15,41,15,47],[15,48,15,53],[15,34,15,40],[12,19,12,22],[12,23,12,26],[12,27,12,33],[12,41,12,47],[12,48,12,53],[12,34,12,40],[13,1,13,2],[13,3,13,6],[13,7,13,11],[13,12,13,18],[13,19,13,22],[13,23,13,26],[13,27,13,33],[13,41,13,47],[13,48,13,53],[13,34,13,40],[10,19,10,22],[10,23,10,26],[10,27,10,33],[10,41,10,47],[10,48,10,53],[11,1,11,2],[11,3,11,6],[11,7,11,11],[11,12,11,18],[11,19,11,22],[11,23,11,26],[11,27,11,33],[11,41,11,47],[11,48,11,53],[10,34,10,40],[11,34,11,40],[26,1,26,2],[26,3,26,6],[26,7,26,11],[26,12,26,18],[9,1,9,2],[9,3,9,6],[9,7,9,11],[9,12,9,18],[28,7,28,11],[28,12,28,18],[10,1,10,2],[10,3,10,6],[10,7,10,11],[10,12,10,18],[12,1,12,2],[12,3,12,6],[12,7,12,11],[12,12,12,18],[14,1,14,2],[14,3,14,6],[14,7,14,11],[14,12,14,18],[16,1,16,2],[16,3,16,6],[30,1,30,2],[30,3,30,6],[30,7,30,11],[30,12,30,18],[31,1,31,2],[31,3,31,6],[6,48,7,53],[8,48,8,53],[9,48,9,53],[8,27,8,33],[8,41,8,47],[9,27,9,33],[9,41,9,47],[6,19,7,22],[6,23,7,26],[6,27,7,33],[6,41,7,47],[8,19,8,22],[9,19,9,22],[6,34,7,40],[8,34,8,40],[9,34,9,40],[31,7,31,11],[31,12,31,18],[8,23,8,26],[9,23,9,26],[1,1,1,53],[44,1,44,53],[52,44,52,53],[41,1,41,53],[42,1,42,20],[42,21,42,53],[43,1,43,20],[43,21,43,53],[8,1,8,2],[8,3,8,6],[8,7,8,11],[8,12,8,18],[27,1,27,2],[27,3,27,6],[27,7,27,11],[27,12,27,18],[28,1,28,2],[28,3,28,6],[29,1,29,2],[29,3,29,6],[29,7,29,11],[29,12,29,18],[4,12,4,22],[3,23,3,33],[4,23,4,42],[3,43,3,53],[4,43,4,53],[5,1,5,18],[6,1,7,2],[6,3,7,6],[6,7,7,11],[6,12,7,18],[53,1,53,20],[53,21,53,43],[53,44,53,53],[45,1,45,53],[48,1,48,53],[51,1,51,53],[46,44,46,53],[47,44,47,53],[46,21,46,43],[47,21,47,43],[46,1,46,20],[47,1,47,20],[49,1,49,20],[49,21,49,43],[49,44,49,53],[50,1,50,20],[50,21,50,43],[50,44,50,53],[52,1,52,20],[52,21,52,43],[0,1,0,37],[26,19,26,22],[27,34,27,40],[28,34,28,40],[29,34,29,40],[26,23,26,26],[26,27,26,33],[26,41,26,47],[26,48,26,53],[27,19,27,22],[27,23,27,26],[27,27,27,33],[27,41,27,47],[26,34,26,40],[27,48,27,53],[28,19,28,22],[28,23,28,26],[28,27,28,33],[28,41,28,47],[28,48,28,53],[5,19,5,53],[3,1,3,11],[4,1,4,11],[3,12,3,22]]}
[null,"First Article Inspection",null,null,null,null,null,null,null,null,null,null,null,null,null,null,null,null,null,null,null,null,null,null,null,null,null,null,null,null,null,null,null,null,null,null,null,null,null,null,null,null,null,null,null,null,null,null,null,"Page",null,1,"of",1]
[null,"Form 3: Dimensional Inspection Report "]
[]
[null,"40. Part/Item Number:",null,null,null,null,null,null,null,null,null,null,"41. Part Name:",null,null,null,null,null,null,null,null,null,null,"42. Serial Number:",null,null,null,null,null,null,null,null,null,null,null,null,null,null,null,null,null,null,null,"43. FAIR Report Number:"]
[null,{"$f":"'Approval Form'!I12","v":0},null,null,null,null,null,null,null,null,null,null,{"$f":"'Approval Form'!I13","v":0},null,null,null,null,null,null,null,null,null,null,{"$f":"'Approval Form'!Y13","v":0},null,null,null,null,null,null,null,null,null,null,null,null,null,null,null,null,null,null,null,{"$f":"'Approval Form'!AF4","v":"Vendor Code Required"}]
[null,"Feature Requirements and Identification",null,null,null,null,null,null,null,null,null,null,null,null,null,null,null,null,null,"Inspection / Test Results"]
{"$rows_left_out":48}
{"sheet":"Changes","index":7,"n_rows":9,"n_cols":4,"rows_kept":9,"cut":false,"hidden":false,"merged":[]}
["Revision No.","Date","Description of change","Author"]
["A","23 May 2014","Workbook first created with detail instructions, approval form, content review report and forms 1,2 and 3. ","Eleni Vorgia "]
["B","13 June 2014","RR approval signature and date added to form 2. Original box 43 in form 3 changed from 'Designed or special tooling used' to ' Inspection tooling used' Form 3 also include additional column with inspectors name. Numbering in forms 2 and 3 updated to reflect these changes. The intrustions were also modified to include the changes made.","Eleni Vorgia "]
["C","09 Oct. 2014","\"N/A\" included in \"Content Review Report\", formating","Jakub Nabielec"]
["D","22 Oct. 2018","Updated to remove RRM branding & references","Andrew Wall"]
["E","10 Dec 2019","Updated footer","Giso Heising"]
{"$rows_left_out":3}